Target
Kappa-type opioid receptor
Ligand
BDBM50045785
Substrate
Meas. Tech.
ChEBML_220942
Ki
2.3±n/a nM
Citation
 Mitch, CHLeander, JDMendelsohn, LGShaw, WNWong, DTCantrell, BEJohnson, BGReel, JKSnoddy, JDTakemori, AE 3,4-Dimethyl-4-(3-hydroxyphenyl)piperidines: opioid antagonists with potent anorectant activity. J Med Chem 36:2842-50 (1993)  
Target
Name:
Kappa-type opioid receptor
Synonyms:
Kappa Opioid Receptor OPRK1 Opiate Kappa 1 | mu/kappa opioid receptor
Type:
G Protein-Coupled Receptor (GPCR)
Mol. Mass.:
42744.99
Organism:
Cavia porcellus (domestic guinea pig)
Description:
P41144
Residue:
380
  
Inhibitor
Name:
BDBM50045785
Synonyms:
3-[1-(3-Cyclohexyl-propyl)-3,4-dimethyl-piperidin-4-yl]-phenol | CHEMBL431266
Type:
Small organic molecule
Emp. Form.:
C22H35NO
Mol. Mass.:
329.5194
SMILES:
C[C@H]1CN(CCCC2CCCCC2)CC[C@@]1(C)c1cccc(O)c1
: