Target
Platelet-activating factor receptor
Ligand
BDBM50045970
Substrate
Meas. Tech.
ChEMBL_151692 (CHEMBL760442)
IC50
9.1±n/a nM
Citation
 Carceller, EMerlos, MGiral, MAlmansa, CBartrolí, JGarcía-Rafanell, JForn, J Synthesis and structure-activity relationships of 1-acyl-4-((2-methyl-3-pyridyl)cyanomethyl)piperazines as PAF antagonists. J Med Chem 36:2984-97 (1993)  
Target
Name:
Platelet-activating factor receptor
Synonyms:
PAF-R PTAFR_CAVPO Platelet-activating factor receptor
Type:
Protein
Mol. Mass.:
39005.63
Organism:
Cavia porcellus
Description:
Residue:
342
  
Inhibitor
Name:
BDBM50045970
Synonyms:
CHEMBL102918 | N-(3-{4-[Cyano-(2-methyl-pyridin-3-yl)-methyl]-piperazin-1-yl}-3-oxo-1-phenyl-propyl)-benzamide
Type:
Small organic molecule
Emp. Form.:
C28H29N5O2
Mol. Mass.:
467.5622
SMILES:
Cc1ncccc1C(C#N)N1CCN(CC1)C(=O)CC(NC(=O)c1ccccc1)c1ccccc1
: