Target
Platelet-activating factor receptor
Ligand
BDBM50045975
Substrate
Meas. Tech.
ChEMBL_151692 (CHEMBL760442)
IC50
34±n/a nM
Citation
 Carceller, EMerlos, MGiral, MAlmansa, CBartrolí, JGarcía-Rafanell, JForn, J Synthesis and structure-activity relationships of 1-acyl-4-((2-methyl-3-pyridyl)cyanomethyl)piperazines as PAF antagonists. J Med Chem 36:2984-97 (1993)  
Target
Name:
Platelet-activating factor receptor
Synonyms:
PAF-R PTAFR_CAVPO Platelet-activating factor receptor
Type:
Protein
Mol. Mass.:
39005.63
Organism:
Cavia porcellus
Description:
Residue:
342
  
Inhibitor
Name:
BDBM50045975
Synonyms:
CHEMBL99795 | {4-[2-(Benzhydryl-amino)-3-hydroxy-propionyl]-piperazin-1-yl}-(2-methyl-pyridin-3-yl)-acetonitrile
Type:
Small organic molecule
Emp. Form.:
C28H31N5O2
Mol. Mass.:
469.578
SMILES:
Cc1ncccc1C(C#N)N1CCN(CC1)C(=O)[C@H](CO)NC(c1ccccc1)c1ccccc1
: