Target
Platelet-activating factor receptor
Ligand
BDBM50045958
Substrate
Meas. Tech.
ChEBML_151691
IC50
36±n/a nM
Citation
 Carceller, EMerlos, MGiral, MAlmansa, CBartrolí, JGarcía-Rafanell, JForn, J Synthesis and structure-activity relationships of 1-acyl-4-((2-methyl-3-pyridyl)cyanomethyl)piperazines as PAF antagonists. J Med Chem 36:2984-97 (1993)  
Target
Name:
Platelet-activating factor receptor
Synonyms:
PAF-R PTAFR_CAVPO Platelet-activating factor receptor
Type:
Protein
Mol. Mass.:
39005.63
Organism:
Cavia porcellus
Description:
Residue:
342
  
Inhibitor
Name:
BDBM50045958
Synonyms:
CHEMBL99833 | [4-(3-Hydroxy-3-phenyl-butyryl)-piperazin-1-yl]-(2-methyl-pyridin-3-yl)-acetonitrile
Type:
Small organic molecule
Emp. Form.:
C22H26N4O2
Mol. Mass.:
378.4674
SMILES:
Cc1ncccc1C(C#N)N1CCN(CC1)C(=O)CC(C)(O)c1ccccc1
: