Target
Platelet-activating factor receptor
Ligand
BDBM50045980
Substrate
Meas. Tech.
ChEBML_151691
IC50
46±n/a nM
Citation
 Carceller, EMerlos, MGiral, MAlmansa, CBartrolí, JGarcía-Rafanell, JForn, J Synthesis and structure-activity relationships of 1-acyl-4-((2-methyl-3-pyridyl)cyanomethyl)piperazines as PAF antagonists. J Med Chem 36:2984-97 (1993)  
Target
Name:
Platelet-activating factor receptor
Synonyms:
PAF-R PTAFR_CAVPO Platelet-activating factor receptor
Type:
Protein
Mol. Mass.:
39005.63
Organism:
Cavia porcellus
Description:
Residue:
342
  
Inhibitor
Name:
BDBM50045980
Synonyms:
4-{4-[Cyano-(2-methyl-pyridin-3-yl)-methyl]-piperazin-1-yl}-4-oxo-2,2-diphenyl-butyric acid ethyl ester | CHEMBL103533
Type:
Small organic molecule
Emp. Form.:
C30H32N4O3
Mol. Mass.:
496.6001
SMILES:
CCOC(=O)C(CC(=O)N1CCN(CC1)C(C#N)c1cccnc1C)(c1ccccc1)c1ccccc1
: