Target
Platelet-activating factor receptor
Ligand
BDBM50045982
Substrate
Meas. Tech.
ChEMBL_151692 (CHEMBL760442)
IC50
11±n/a nM
Citation
 Carceller, EMerlos, MGiral, MAlmansa, CBartrolí, JGarcía-Rafanell, JForn, J Synthesis and structure-activity relationships of 1-acyl-4-((2-methyl-3-pyridyl)cyanomethyl)piperazines as PAF antagonists. J Med Chem 36:2984-97 (1993)  
Target
Name:
Platelet-activating factor receptor
Synonyms:
PAF-R PTAFR_CAVPO Platelet-activating factor receptor
Type:
Protein
Mol. Mass.:
39005.63
Organism:
Cavia porcellus
Description:
Residue:
342
  
Inhibitor
Name:
BDBM50045982
Synonyms:
CHEMBL103596 | [4-(3-Methylamino-3-phenyl-propionyl)-piperazin-1-yl]-(2-methyl-pyridin-3-yl)-acetonitrile
Type:
Small organic molecule
Emp. Form.:
C22H27N5O
Mol. Mass.:
377.4827
SMILES:
CNC(CC(=O)N1CCN(CC1)C(C#N)c1cccnc1C)c1ccccc1
: