Target
Platelet-activating factor receptor
Ligand
BDBM50046009
Substrate
Meas. Tech.
ChEBML_151691
IC50
350±n/a nM
Citation
 Carceller, EMerlos, MGiral, MAlmansa, CBartrolí, JGarcía-Rafanell, JForn, J Synthesis and structure-activity relationships of 1-acyl-4-((2-methyl-3-pyridyl)cyanomethyl)piperazines as PAF antagonists. J Med Chem 36:2984-97 (1993)  
Target
Name:
Platelet-activating factor receptor
Synonyms:
PAF-R PTAFR_CAVPO Platelet-activating factor receptor
Type:
Protein
Mol. Mass.:
39005.63
Organism:
Cavia porcellus
Description:
Residue:
342
  
Inhibitor
Name:
BDBM50046009
Synonyms:
(2-Methyl-pyridin-3-yl)-[4-(3-phenyl-3-pyrrol-1-yl-propionyl)-piperazin-1-yl]-acetonitrile | CHEMBL317380
Type:
Small organic molecule
Emp. Form.:
C25H27N5O
Mol. Mass.:
413.5148
SMILES:
Cc1ncccc1C(C#N)N1CCN(CC1)C(=O)CC(c1ccccc1)n1cccc1
: