Target
Sodium channel protein type 9 subunit alpha
Ligand
BDBM50393023
Substrate
Meas. Tech.
ChEMBL_1459377 (CHEMBL3368022)
Ki
19±n/a nM
Citation
 Bagal, SKChapman, MLMarron, BEPrime, RStorer, RISwain, NA Recent progress in sodium channel modulators for pain. Bioorg Med Chem Lett 24:3690-9 (2014)  
Target
Name:
Sodium channel protein type 9 subunit alpha
Synonyms:
NENA Peripheral sodium channel 1 SCN9A_HUMAN Voltage-gated sodium channel subunit Nav1.7 hNE-Na
Type:
Protein
Mol. Mass.:
226375.97
Organism:
Homo sapiens (Human)
Description:
Q15858
Residue:
1988
  
Inhibitor
Name:
BDBM50393023
Synonyms:
CHEMBL2152688
Type:
Small organic molecule
Emp. Form.:
C24H22FN5O4S
Mol. Mass.:
495.526
SMILES:
CS(=O)(=O)N[C@@H](Cc1cnc[nH]1)C(=O)Nc1cccc(n1)-c1ccc(Oc2ccc(F)cc2)cc1
: