Target
Thromboxane-A synthase
Ligand
BDBM50046312
Substrate
Meas. Tech.
ChEBML_213094
IC50
3.5±n/a nM
Citation
 Bhagwat, SSGude, CCohen, DSDotson, RMathis, JLee, WFurness, P Thromboxane receptor antagonism combined with thromboxane synthase inhibition. 5. Synthesis and evaluation of enantiomers of 8-[[(4-chlorophenyl)sulfonyl]amino]-4-(3-pyridinylalkyl)octanoic acid. J Med Chem 36:205-10 (1993)  
Target
Name:
Thromboxane-A synthase
Synonyms:
CYP5 Cytochrome P450 5A1 TBXAS1 TXA synthase TXS Thromboxane A2 Synthase (P450 TxA2) Thromboxane prostanoid Thromboxane-A synthase
Type:
Enzyme
Mol. Mass.:
60524.67
Organism:
Homo sapiens (Human)
Description:
P24557
Residue:
533
  
Inhibitor
Name:
BDBM50046312
Synonyms:
8-(4-Chloro-benzenesulfonylamino)-4-[2-(pyridin-3-yloxy)-ethyl]-octanoic acid | CHEMBL68058
Type:
Small organic molecule
Emp. Form.:
C21H27ClN2O5S
Mol. Mass.:
454.967
SMILES:
OC(=O)CC[C@H](CCCCNS(=O)(=O)c1ccc(Cl)cc1)CCOc1cccnc1
: