Target
Gag-Pol polyprotein [489-587]
Ligand
BDBM50046408
Substrate
Meas. Tech.
ChEMBL_159311 (CHEMBL769364)
IC50
1.7±n/a nM
Citation
 Kempf, DJCodacovi, LWang, XCKohlbrenner, WEWideburg, NESaldivar, AVasavanonda, SMarsh, KCBryant, PSham, HL Symmetry-based inhibitors of HIV protease. Structure-activity studies of acylated 2,4-diamino-1,5-diphenyl-3-hydroxypentane and 2,5-diamino-1,6-diphenylhexane-3,4-diol. J Med Chem 36:320-30 (1993)  
Target
Name:
Gag-Pol polyprotein [489-587]
Synonyms:
Human immunodeficiency virus type 1 protease Pol polyprotein | gag-pol
Type:
Enzyme Subunit
Mol. Mass.:
10781.16
Organism:
Human immunodeficiency virus type 1
Description:
P04585[489-587]
Residue:
99
  
Inhibitor
Name:
BDBM50046408
Synonyms:
(1-{1-Benzyl-2,3-dihydroxy-4-[3-methyl-2-(pyridin-4-ylmethoxycarbonylamino)-butyrylamino]-5-phenyl-pentylcarbamoyl}-2-methyl-propyl)-carbamic acid pyridin-4-ylmethyl ester | CHEMBL322804
Type:
Small organic molecule
Emp. Form.:
C42H52N6O8
Mol. Mass.:
768.8977
SMILES:
CC(C)[C@H](NC(=O)OCc1ccncc1)C(=O)N[C@@H](Cc1ccccc1)[C@@H](O)[C@@H](O)[C@H](Cc1ccccc1)NC(=O)[C@H](NC(=O)OCc1ccncc1)C(C)C
: