Target
Gag-Pol polyprotein [489-587]
Ligand
BDBM50046383
Substrate
Meas. Tech.
ChEMBL_159311 (CHEMBL769364)
IC50
12±n/a nM
Citation
 Kempf, DJCodacovi, LWang, XCKohlbrenner, WEWideburg, NESaldivar, AVasavanonda, SMarsh, KCBryant, PSham, HL Symmetry-based inhibitors of HIV protease. Structure-activity studies of acylated 2,4-diamino-1,5-diphenyl-3-hydroxypentane and 2,5-diamino-1,6-diphenylhexane-3,4-diol. J Med Chem 36:320-30 (1993)  
Target
Name:
Gag-Pol polyprotein [489-587]
Synonyms:
Human immunodeficiency virus type 1 protease Pol polyprotein | gag-pol
Type:
Enzyme Subunit
Mol. Mass.:
10781.16
Organism:
Human immunodeficiency virus type 1
Description:
P04585[489-587]
Residue:
99
  
Inhibitor
Name:
BDBM50046383
Synonyms:
CHEMBL331829 | N-{1-Benzyl-2-hydroxy-3-[3-methyl-2-(3-pyridin-2-yl-propionylamino)-butyrylamino]-4-phenyl-butyl}-3-methyl-2-(3-pyridin-2-yl-propionylamino)-butyramide
Type:
Small organic molecule
Emp. Form.:
C43H54N6O5
Mol. Mass.:
734.9261
SMILES:
CC(C)[C@H](NC(=O)CCc1ccccn1)C(=O)N[C@@H](Cc1ccccc1)C(O)[C@H](Cc1ccccc1)NC(=O)[C@H](NC(=O)CCc1ccccn1)C(C)C
: