Target
Gag-Pol polyprotein [489-587]
Ligand
BDBM50046436
Substrate
Meas. Tech.
ChEMBL_159311 (CHEMBL769364)
IC50
180±n/a nM
Citation
 Kempf, DJCodacovi, LWang, XCKohlbrenner, WEWideburg, NESaldivar, AVasavanonda, SMarsh, KCBryant, PSham, HL Symmetry-based inhibitors of HIV protease. Structure-activity studies of acylated 2,4-diamino-1,5-diphenyl-3-hydroxypentane and 2,5-diamino-1,6-diphenylhexane-3,4-diol. J Med Chem 36:320-30 (1993)  
Target
Name:
Gag-Pol polyprotein [489-587]
Synonyms:
Human immunodeficiency virus type 1 protease Pol polyprotein | gag-pol
Type:
Enzyme Subunit
Mol. Mass.:
10781.16
Organism:
Human immunodeficiency virus type 1
Description:
P04585[489-587]
Residue:
99
  
Inhibitor
Name:
BDBM50046436
Synonyms:
(1-{1-Benzyl-2-hydroxy-3-[3-methyl-2-(2-morpholin-4-yl-ethoxycarbonylamino)-butyrylamino]-4-phenyl-butylcarbamoyl}-2-methyl-propyl)-carbamic acid 2-morpholin-4-yl-ethyl ester | CHEMBL325847
Type:
Small organic molecule
Emp. Form.:
C41H62N6O9
Mol. Mass.:
782.9658
SMILES:
CC(C)[C@H](NC(=O)OCCN1CCOCC1)C(=O)N[C@@H](Cc1ccccc1)C(O)[C@H](Cc1ccccc1)NC(=O)[C@H](NC(=O)OCCN1CCOCC1)C(C)C
: