Target
Gag-Pol polyprotein [489-587]
Ligand
BDBM50046447
Substrate
Meas. Tech.
ChEMBL_159311 (CHEMBL769364)
IC50
9±n/a nM
Citation
 Kempf, DJCodacovi, LWang, XCKohlbrenner, WEWideburg, NESaldivar, AVasavanonda, SMarsh, KCBryant, PSham, HL Symmetry-based inhibitors of HIV protease. Structure-activity studies of acylated 2,4-diamino-1,5-diphenyl-3-hydroxypentane and 2,5-diamino-1,6-diphenylhexane-3,4-diol. J Med Chem 36:320-30 (1993)  
Target
Name:
Gag-Pol polyprotein [489-587]
Synonyms:
Human immunodeficiency virus type 1 protease Pol polyprotein | gag-pol
Type:
Enzyme Subunit
Mol. Mass.:
10781.16
Organism:
Human immunodeficiency virus type 1
Description:
P04585[489-587]
Residue:
99
  
Inhibitor
Name:
BDBM50046447
Synonyms:
1N-[1-[1-benzyl-4-[1-(4-benzylhexahydro-1-pyrazinylcarboxamido)-2-methyl-(1S)-propylcarboxamido]-2,3-dihydroxy-5-phenyl-(1S,2R,3S,4S)-pentylcarbamoyl]-2-methyl-(1R)-propyl]-4-benzylhexahydro-1-pyrazinecarboxamide | CHEMBL330915
Type:
Small organic molecule
Emp. Form.:
C52H70N8O6
Mol. Mass.:
903.1622
SMILES:
CC(C)[C@H](NC(=O)N1CCN(Cc2ccccc2)CC1)C(=O)N[C@@H](Cc1ccccc1)[C@H](O)[C@H](O)[C@H](Cc1ccccc1)NC(=O)[C@H](NC(=O)N1CCN(Cc2ccccc2)CC1)C(C)C
: