Target
Neuropeptide Y receptor type 1
Ligand
BDBM50046548
Substrate
Meas. Tech.
ChEMBL_144145 (CHEMBL750760)
Ki
>1000±n/a nM
Citation
 Kirby, DAKoerber, SCCraig, AGFeinstein, RDDelmas, LBrown, MRRivier, JE Defining structural requirements for neuropeptide Y receptors using truncated and conformationally restricted analogues. J Med Chem 36:385-93 (1993)  
Target
Name:
Neuropeptide Y receptor type 1
Synonyms:
NPY-Y1 NPY1R NPYR neuropeptide Y receptor Y1
Type:
Enzyme Catalytic Domain
Mol. Mass.:
44399.07
Organism:
Homo sapiens (Human)
Description:
NPY-Y1 NPY1R HUMAN::P25929
Residue:
384
  
Inhibitor
Name:
BDBM50046548
Synonyms:
CHEMBL2370634 | Tyr-c(Asp-Ser-Lys-Pro-(D-Ala)-Arg-His-(DDpr))-Ile-Asn-Leu-Ile-Thr-Arg-Gln-Arg-Tyr
Type:
Small organic molecule
Emp. Form.:
C98H157N33O26
Mol. Mass.:
2213.5007
SMILES:
[H][C@@]12CCCN1C(=O)[C@H](CCCCN)NC(=O)[C@H](CO)NC(=O)[C@H](CCC(=O)N[C@@H](CNC(=O)[C@H](Cc1c[nH]cn1)NC(=O)[C@H](CCCN=C(N)N)NC(=O)[C@@H](C)NC2=O)C(=O)N[C@@H]([C@@H](C)CC)C(=O)N[C@@H](CC(N)=O)C(=O)N[C@@H](CC(C)C)C(=O)N[C@@H]([C@@H](C)CC)C(=O)N[C@@H]([C@@H](C)O)C(=O)N[C@@H](CCCN=C(N)N)C(=O)N[C@@H](CCC(N)=O)C(=O)N[C@@H](CCCN=C(N)N)C(=O)N[C@@H](Cc1ccc(O)cc1)C(O)=O)NC(=O)[C@@H](N)Cc1ccc(O)cc1
: