Target
Neuropeptide Y receptor type 2
Ligand
BDBM50046553
Substrate
Meas. Tech.
ChEMBL_144149 (CHEMBL750764)
Ki
0.5±n/a nM
Citation
 Kirby, DAKoerber, SCCraig, AGFeinstein, RDDelmas, LBrown, MRRivier, JE Defining structural requirements for neuropeptide Y receptors using truncated and conformationally restricted analogues. J Med Chem 36:385-93 (1993)  
Target
Name:
Neuropeptide Y receptor type 2
Synonyms:
NPY-Y2 NPY2-R NPY2R_HUMAN Y2 receptor | neuropeptide Y receptor Y2
Type:
Enzyme Catalytic Domain
Mol. Mass.:
42734.65
Organism:
Homo sapiens (Human)
Description:
NPY-Y2 NPY2R HUMAN::P49146
Residue:
381
  
Inhibitor
Name:
BDBM50046553
Synonyms:
CHEMBL437421 | Tyr-Pro-Ser-Lys-Pro-(D-Ala)-Arg-His-Tyr-c(Lys-Asn-Leu-Ile-Glu)-Arg-Gln-Arg-Tyr
Type:
Small organic molecule
Emp. Form.:
C105H161N33O26
Mol. Mass.:
2301.6073
SMILES:
CC[C@H](C)[C@@H]1NC(=O)[C@@H](CC(C)C)NC(=O)[C@H](CC(N)=O)NC(=O)[C@H](CCCCNC(=O)CC[C@H](NC1=O)C(=O)N[C@@H](CCCNC(N)=N)C(=O)N[C@@H](CCC(N)=O)C(=O)N[C@@H](CCCNC(N)=N)C(=O)N[C@@H](Cc1ccc(O)cc1)C(O)=O)NC(=O)[C@H](Cc1ccc(O)cc1)NC(=O)[C@H](Cc1cnc[nH]1)NC(=O)[C@H](CCCNC(N)=N)NC(=O)[C@@H](C)NC(=O)[C@H]1CCCN1C(=O)[C@H](CCCCN)NC(=O)[C@H](CO)NC(=O)[C@@H]1CCCN1C(=O)[C@H](N)Cc1ccc(O)cc1
: