Target
5-hydroxytryptamine receptor 1A
Ligand
BDBM50046598
Substrate
Meas. Tech.
ChEMBL_588 (CHEMBL615458)
Ki
1±n/a nM
Citation
 Lin, CHHaadsma-Svensson, SRLahti, RAMcCall, RBPiercey, MFSchreur, PJVonVoigtlander, PFChidester, CG Centrally acting serotonergic agents. Synthesis and structure-activity relationships of C-1- or C-3-substituted derivatives of 8-hydroxy-2-(di-n-propylamino)tetralin. J Med Chem 36:671-82 (1993)  
Target
Name:
5-hydroxytryptamine receptor 1A
Synonyms:
5-HT-1A 5-hydroxytryptamine receptor 1A (5-HT-1A) ADRB2RL1 Dopamine D2 receptor and serotonin 1a receptor HTR1A | Serotonin receptor 1A
Type:
Mol. Mass.:
46122.49
Organism:
Homo sapiens (Human)
Description:
Residue:
422
  
Inhibitor
Name:
BDBM50046598
Synonyms:
8-Allyl-7-allylamino-5,6,7,8-tetrahydro-naphthalen-1-ol | CHEMBL158210
Type:
Small organic molecule
Emp. Form.:
C16H21NO
Mol. Mass.:
243.344
SMILES:
Oc1cccc2CC[C@@H](NCC=C)[C@@H](CC=C)c12
: