Target
Renin
Ligand
BDBM50046773
Substrate
Meas. Tech.
ChEMBL_195746 (CHEMBL801598)
pH
7.4±n/a
IC50
17±n/a nM
Comments
extracted
Citation
 Rosenberg, SHSpina, KPWoods, KWPolakowski, JMartin, DLYao, ZStein, HHCohen, JBarlow, JLEgan, DA Studies directed toward the design of orally active renin inhibitors. 1. Some factors influencing the absorption of small peptides. J Med Chem 36:449-59 (1993)  
Target
Name:
Renin
Synonyms:
Angiotensinogenase RENI_HUMAN
Type:
Enzyme
Mol. Mass.:
45058.99
Organism:
Homo sapiens (Human)
Description:
Residue:
406
  
Inhibitor
Name:
BDBM50046773
Synonyms:
3-Amino-N-[1-[1-[1-cyclohexylmethyl-2-(3-ethyl-2-oxo-oxazolidin-5-yl)-2-hydroxy-ethylcarbamoyl]-2-(1H-imidazol-4-yl)-ethylcarbamoyl]-2-(4-methoxy-phenyl)-ethyl]-3-methyl-butyramide | CHEMBL140704
Type:
Small organic molecule
Emp. Form.:
C35H53N7O7
Mol. Mass.:
683.838
SMILES:
CCN1C[C@H](OC1=O)[C@H](O)[C@H](CC1CCCCC1)NC(=O)[C@H](Cc1cnc[nH]1)NC(=O)[C@H](Cc1ccc(OC)cc1)NC(=O)CC(C)(C)N
: