Target
Renin
Ligand
BDBM50046778
Substrate
Meas. Tech.
ChEMBL_195746 (CHEMBL801598)
pH
7.4±n/a
IC50
25±n/a nM
Comments
extracted
Citation
 Rosenberg, SHSpina, KPWoods, KWPolakowski, JMartin, DLYao, ZStein, HHCohen, JBarlow, JLEgan, DA Studies directed toward the design of orally active renin inhibitors. 1. Some factors influencing the absorption of small peptides. J Med Chem 36:449-59 (1993)  
Target
Name:
Renin
Synonyms:
Angiotensinogenase RENI_HUMAN
Type:
Enzyme
Mol. Mass.:
45058.99
Organism:
Homo sapiens (Human)
Description:
Residue:
406
  
Inhibitor
Name:
BDBM50046778
Synonyms:
2-Benzyl-5-morpholin-4-yl-4-oxo-pentanoic acid [1-(1-cyclohexylmethyl-2,3-dihydroxy-5-methyl-hexylcarbamoyl)-2-thiazol-4-yl-ethyl]-amide | CHEMBL404764
Type:
Small organic molecule
Emp. Form.:
C36H54N4O6S
Mol. Mass.:
670.902
SMILES:
CC(C)C[C@H](O)[C@H](O)[C@H](CC1CCCCC1)NC(=O)[C@H](Cc1cscn1)NC(=O)[C@@H](CC(=O)CN1CCOCC1)Cc1ccccc1
: