Target
Renin
Ligand
BDBM50046779
Substrate
Meas. Tech.
ChEMBL_195746 (CHEMBL801598)
pH
7.4±n/a
IC50
33±n/a nM
Comments
extracted
Citation
 Rosenberg, SHSpina, KPWoods, KWPolakowski, JMartin, DLYao, ZStein, HHCohen, JBarlow, JLEgan, DA Studies directed toward the design of orally active renin inhibitors. 1. Some factors influencing the absorption of small peptides. J Med Chem 36:449-59 (1993)  
Target
Name:
Renin
Synonyms:
Angiotensinogenase RENI_HUMAN
Type:
Enzyme
Mol. Mass.:
45058.99
Organism:
Homo sapiens (Human)
Description:
Residue:
406
  
Inhibitor
Name:
BDBM50046779
Synonyms:
3-Amino-N-[1-[1-(1-cyclohexylmethyl-2,3-dihydroxy-5-methyl-hexylcarbamoyl)-2-thiazol-4-yl-ethylcarbamoyl]-2-(4-methoxy-phenyl)-ethyl]-3-methyl-butyramide | CHEMBL344419
Type:
Small organic molecule
Emp. Form.:
C35H55N5O6S
Mol. Mass.:
673.906
SMILES:
COc1ccc(C[C@H](NC(=O)CC(C)(C)N)C(=O)N[C@@H](Cc2cscn2)C(=O)N[C@@H](CC2CCCCC2)[C@@H](O)[C@@H](O)CC(C)C)cc1
: