Target
Acyl-CoA:cholesterol acyltransferase
Ligand
BDBM50047530
Substrate
Meas. Tech.
ChEMBL_28334 (CHEMBL645898)
IC50
>1000±n/a nM
Citation
 Kimura, TWatanabe, NMatsui, MHayashi, KTanaka, HOhtsuka, ISaeki, TKogushi, MKabayashi, HAkasaka, K Structure-activity relationship of a series of phenylureas linked to 4-phenylimidazole. Novel potent inhibitors of acyl-CoA:cholesterol O-acyltransferase with antiatherosclerotic activity. 2. J Med Chem 36:1641-53 (1993)  
Target
Name:
Acyl-CoA:cholesterol acyltransferase
Synonyms:
ACAT
Type:
Mol. Mass.:
35405.31
Organism:
Oryctolagus cuniculus
Description:
Residue:
305
  
Inhibitor
Name:
BDBM50047530
Synonyms:
1-{2-Methyl-6-[2-(5-methyl-4-phenyl-imidazol-1-yl)-ethanesulfonylmethyl]-phenyl}-3-pentyl-urea | CHEMBL297580
Type:
Small organic molecule
Emp. Form.:
C26H34N4O3S
Mol. Mass.:
482.638
SMILES:
CCCCCNC(=O)Nc1c(C)cccc1CS(=O)(=O)CCn1cnc(c1C)-c1ccccc1
: