Target
Acyl-CoA:cholesterol acyltransferase
Ligand
BDBM50047596
Substrate
Meas. Tech.
ChEBML_28332
IC50
900±n/a nM
Citation
 Kimura, TWatanabe, NMatsui, MHayashi, KTanaka, HOhtsuka, ISaeki, TKogushi, MKabayashi, HAkasaka, K Structure-activity relationship of a series of phenylureas linked to 4-phenylimidazole. Novel potent inhibitors of acyl-CoA:cholesterol O-acyltransferase with antiatherosclerotic activity. 2. J Med Chem 36:1641-53 (1993)  
Target
Name:
Acyl-CoA:cholesterol acyltransferase
Synonyms:
ACAT
Type:
Mol. Mass.:
35405.31
Organism:
Oryctolagus cuniculus
Description:
Residue:
305
  
Inhibitor
Name:
BDBM50047596
Synonyms:
1-(2-Methyl-6-{3-[4-(3,4,5-trimethoxy-phenyl)-imidazol-1-yl]-propoxy}-phenyl)-3-pentyl-urea | CHEMBL44702
Type:
Small organic molecule
Emp. Form.:
C28H38N4O5
Mol. Mass.:
510.6251
SMILES:
CCCCCNC(=O)Nc1c(C)cccc1OCCCn1cnc(c1)-c1cc(OC)c(OC)c(OC)c1
: