Target
Acyl-CoA:cholesterol acyltransferase
Ligand
BDBM50022279
Substrate
Meas. Tech.
ChEBML_28332
IC50
900±n/a nM
Citation
 Kimura, TWatanabe, NMatsui, MHayashi, KTanaka, HOhtsuka, ISaeki, TKogushi, MKabayashi, HAkasaka, K Structure-activity relationship of a series of phenylureas linked to 4-phenylimidazole. Novel potent inhibitors of acyl-CoA:cholesterol O-acyltransferase with antiatherosclerotic activity. 2. J Med Chem 36:1641-53 (1993)  
Target
Name:
Acyl-CoA:cholesterol acyltransferase
Synonyms:
ACAT
Type:
Mol. Mass.:
35405.31
Organism:
Oryctolagus cuniculus
Description:
Residue:
305
  
Inhibitor
Name:
BDBM50022279
Synonyms:
3-(2,4-Difluoro-phenyl)-1-[4-(2,2-dimethyl-propyl)-benzyl]-1-heptyl-urea CL-277082
Type:
Small organic molecule
Emp. Form.:
C26H36F2N2O
Mol. Mass.:
430.5736
SMILES:
CCCCCCCN(Cc1ccc(CC(C)(C)C)cc1)C(=O)Nc1ccc(F)cc1F
: