Target
Acyl-CoA:cholesterol acyltransferase
Ligand
BDBM50047499
Substrate
Meas. Tech.
ChEMBL_28334 (CHEMBL645898)
IC50
43±n/a nM
Citation
 Kimura, TWatanabe, NMatsui, MHayashi, KTanaka, HOhtsuka, ISaeki, TKogushi, MKabayashi, HAkasaka, K Structure-activity relationship of a series of phenylureas linked to 4-phenylimidazole. Novel potent inhibitors of acyl-CoA:cholesterol O-acyltransferase with antiatherosclerotic activity. 2. J Med Chem 36:1641-53 (1993)  
Target
Name:
Acyl-CoA:cholesterol acyltransferase
Synonyms:
ACAT
Type:
Mol. Mass.:
35405.31
Organism:
Oryctolagus cuniculus
Description:
Residue:
305
  
Inhibitor
Name:
BDBM50047499
Synonyms:
1-{2-Dimethylamino-6-[3-(5-methyl-4-phenyl-imidazol-1-yl)-propoxy]-phenyl}-3-pentyl-urea | CHEMBL296094
Type:
Small organic molecule
Emp. Form.:
C27H37N5O2
Mol. Mass.:
463.615
SMILES:
CCCCCNC(=O)Nc1c(OCCCn2cnc(c2C)-c2ccccc2)cccc1N(C)C
: