Target
Acyl-CoA:cholesterol acyltransferase
Ligand
BDBM50047550
Substrate
Meas. Tech.
ChEMBL_28334 (CHEMBL645898)
IC50
77±n/a nM
Citation
 Kimura, TWatanabe, NMatsui, MHayashi, KTanaka, HOhtsuka, ISaeki, TKogushi, MKabayashi, HAkasaka, K Structure-activity relationship of a series of phenylureas linked to 4-phenylimidazole. Novel potent inhibitors of acyl-CoA:cholesterol O-acyltransferase with antiatherosclerotic activity. 2. J Med Chem 36:1641-53 (1993)  
Target
Name:
Acyl-CoA:cholesterol acyltransferase
Synonyms:
ACAT
Type:
Mol. Mass.:
35405.31
Organism:
Oryctolagus cuniculus
Description:
Residue:
305
  
Inhibitor
Name:
BDBM50047550
Synonyms:
1-{2-Methyl-6-[3-(5-methyl-4-phenyl-imidazol-1-yl)-propylsulfanyl]-phenyl}-3-pentyl-urea | CHEMBL47030
Type:
Small organic molecule
Emp. Form.:
C26H34N4OS
Mol. Mass.:
450.639
SMILES:
CCCCCNC(=O)Nc1c(C)cccc1SCCCn1cnc(c1C)-c1ccccc1
: