Target
Acyl-CoA:cholesterol acyltransferase
Ligand
BDBM50047542
Substrate
Meas. Tech.
ChEMBL_28331 (CHEMBL645895)
IC50
71±n/a nM
Citation
 Kimura, TWatanabe, NMatsui, MHayashi, KTanaka, HOhtsuka, ISaeki, TKogushi, MKabayashi, HAkasaka, K Structure-activity relationship of a series of phenylureas linked to 4-phenylimidazole. Novel potent inhibitors of acyl-CoA:cholesterol O-acyltransferase with antiatherosclerotic activity. 2. J Med Chem 36:1641-53 (1993)  
Target
Name:
Acyl-CoA:cholesterol acyltransferase
Synonyms:
ACAT
Type:
Mol. Mass.:
35405.31
Organism:
Oryctolagus cuniculus
Description:
Residue:
305
  
Inhibitor
Name:
BDBM50047542
Synonyms:
1-{2-Fluoro-6-[3-(5-methyl-4-phenyl-imidazol-1-yl)-propoxy]-phenyl}-3-pentyl-urea | CHEMBL43989
Type:
Small organic molecule
Emp. Form.:
C25H31FN4O2
Mol. Mass.:
438.5376
SMILES:
CCCCCNC(=O)Nc1c(F)cccc1OCCCn1cnc(c1C)-c1ccccc1
: