Target
Type-1 angiotensin II receptor
Ligand
BDBM50003399
Substrate
Meas. Tech.
ChEMBL_36941 (CHEMBL648844)
IC50
230±n/a nM
Citation
 Ashton, WTCantone, CLChang, LLHutchins, SMStrelitz, RAMacCoss, MChang, RSLotti, VJFaust, KAChen, TB Nonpeptide angiotensin II antagonists derived from 4H-1,2,4-triazoles and 3H-imidazo[1,2-b][1,2,4]triazoles. J Med Chem 36:591-609 (1993)  
Target
Name:
Type-1 angiotensin II receptor
Synonyms:
AGTR1 ANGIOTENSIN AT1 Angiotensin II type 1a (AT-1a) receptor
Type:
Enzyme Catalytic Domain
Mol. Mass.:
41009.15
Organism:
RABBIT
Description:
ANGIOTENSIN AT1 AGTR1 RABBIT::P34976
Residue:
359
  
Inhibitor
Name:
BDBM50003399
Synonyms:
4'-(2-Butyl-4-chloro-5-hydroxymethyl-imidazol-1-ylmethyl)-biphenyl-2-carboxylic acid 4-Chloro-5-hydroxymethyl-3-imidazol-1-ylmethyl-biphenyl-2-carboxylic acid butyl ester i4'-(2-Butyl-4-chloro-5-hydroxymethyl-imidazol-1-ylmethyl)-biphenyl-2-carboxylic acid | {2-Butyl-5-chloro-3-[2'-(2H-tetrazol-5-yl)-biphenyl-4-ylmethyl]-3H-imidazol-4-yl}-methanol (EXP7711 (IMI))
Type:
Small organic molecule
Emp. Form.:
C22H23ClN2O3
Mol. Mass.:
398.883
SMILES:
CCCCc1nc(Cl)c(CO)n1Cc1ccc(cc1)-c1ccccc1C(O)=O
: