Target
Type-1 angiotensin II receptor
Ligand
BDBM50047861
Substrate
Meas. Tech.
ChEMBL_36941 (CHEMBL648844)
IC50
7.4±n/a nM
Citation
 Ashton, WTCantone, CLChang, LLHutchins, SMStrelitz, RAMacCoss, MChang, RSLotti, VJFaust, KAChen, TB Nonpeptide angiotensin II antagonists derived from 4H-1,2,4-triazoles and 3H-imidazo[1,2-b][1,2,4]triazoles. J Med Chem 36:591-609 (1993)  
Target
Name:
Type-1 angiotensin II receptor
Synonyms:
AGTR1 ANGIOTENSIN AT1 Angiotensin II type 1a (AT-1a) receptor
Type:
Enzyme Catalytic Domain
Mol. Mass.:
41009.15
Organism:
RABBIT
Description:
ANGIOTENSIN AT1 AGTR1 RABBIT::P34976
Residue:
359
  
Inhibitor
Name:
BDBM50047861
Synonyms:
CHEMBL158133 | N-{4-[3-Butyl-5-(4-methoxy-phenylmethanesulfinyl)-[1,2,4]triazol-4-ylmethyl]-phenyl}-phthalamic acid
Type:
Small organic molecule
Emp. Form.:
C29H30N4O5S
Mol. Mass.:
546.637
SMILES:
CCCCc1nnc(n1Cc1ccc(NC(=O)c2ccccc2C(O)=O)cc1)S(=O)Cc1ccc(OC)cc1
: