Target
Type-1 angiotensin II receptor
Ligand
BDBM50047798
Substrate
Meas. Tech.
ChEMBL_36941 (CHEMBL648844)
IC50
1.4±n/a nM
Citation
 Ashton, WTCantone, CLChang, LLHutchins, SMStrelitz, RAMacCoss, MChang, RSLotti, VJFaust, KAChen, TB Nonpeptide angiotensin II antagonists derived from 4H-1,2,4-triazoles and 3H-imidazo[1,2-b][1,2,4]triazoles. J Med Chem 36:591-609 (1993)  
Target
Name:
Type-1 angiotensin II receptor
Synonyms:
AGTR1 ANGIOTENSIN AT1 Angiotensin II type 1a (AT-1a) receptor
Type:
Enzyme Catalytic Domain
Mol. Mass.:
41009.15
Organism:
RABBIT
Description:
ANGIOTENSIN AT1 AGTR1 RABBIT::P34976
Residue:
359
  
Inhibitor
Name:
BDBM50047798
Synonyms:
5-[2-(4-{3-butyl-5-[2-(1H-1,2,3,4-tetraazol-5-yl)benzylsulfanyl]-4H-1,2,4-triazol-4-ylmethyl}phenyl)phenyl]-1H-1,2,3,4-tetraazole | CHEMBL352236
Type:
Small organic molecule
Emp. Form.:
C28H27N11S
Mol. Mass.:
549.653
SMILES:
CCCCc1nnc(SCc2ccccc2-c2nnn[nH]2)n1Cc1ccc(cc1)-c1ccccc1-c1nnn[nH]1
: