Target
Type-1 angiotensin II receptor B
Ligand
BDBM50006909
Substrate
Meas. Tech.
ChEMBL_34820 (CHEMBL648754)
IC50
37±n/a nM
Citation
 Ashton, WTCantone, CLChang, LLHutchins, SMStrelitz, RAMacCoss, MChang, RSLotti, VJFaust, KAChen, TB Nonpeptide angiotensin II antagonists derived from 4H-1,2,4-triazoles and 3H-imidazo[1,2-b][1,2,4]triazoles. J Med Chem 36:591-609 (1993)  
Target
Name:
Type-1 angiotensin II receptor B
Synonyms:
AGTRB_RAT Agtr1 Angiotensin II AT1B Angiotensin II type 1b (AT-1b) receptor Type-1B angiotensin II receptor
Type:
Enzyme Catalytic Domain
Mol. Mass.:
40929.44
Organism:
RAT
Description:
Angiotensin II AT1B 0 RAT::P29089
Residue:
359
  
Inhibitor
Name:
BDBM50006909
Synonyms:
2-Butyl-5-chloro-3-[2'-(1H-tetrazol-5-yl)-biphenyl-4-ylmethyl]-3H-imidazole-4-carboxylic acid 2-Butyl-5-chloro-3-[2'-(2H-tetrazol-5-yl)-biphenyl-4-ylmethyl]-3H-imidazole-4-carboxylic acid CHEMBL907 E 3174 | EXP3174
Type:
Small organic molecule
Emp. Form.:
C22H21ClN6O2
Mol. Mass.:
436.894
SMILES:
CCCCc1nc(Cl)c(C(O)=O)n1Cc1ccc(cc1)-c1ccccc1-c1nnn[nH]1
: