Target
Amine oxidase [flavin-containing] B
Ligand
BDBM50016907
Substrate
Meas. Tech.
ChEBML_100077
Ki
10000000±n/a nM
Citation
 Ding, CZLu, XNishimura, KSilverman, RB Transformation of monoamine oxidase-B primary amine substrates into time-dependent inhibitors. Tertiary amine homologues of primary amine substrates. J Med Chem 36:1711-5 (1993)  
Target
Name:
Amine oxidase [flavin-containing] B
Synonyms:
AOFB_BOVIN MAO-B Monoamine Oxidase Type B (MAO-B) Monoamine oxidase B | Monoamine oxidase type B
Type:
PROTEIN
Mol. Mass.:
58428.94
Organism:
Bos taurus
Description:
ChEMBL_1501478
Residue:
520
  
Inhibitor
Name:
BDBM50016907
Synonyms:
CHEMBL46841 | Dimethyl-(4-phenyl-butyl)-amine
Type:
Small organic molecule
Emp. Form.:
C12H19N
Mol. Mass.:
177.286
SMILES:
CN(C)CCCCc1ccccc1
: