Target
Interleukin-1 receptor-associated kinase 4
Ligand
BDBM50499197
Substrate
Meas. Tech.
ChEMBL_1538243 (CHEMBL3737182)
Ki
1.3±n/a nM
Citation
 Wang, ZSun, DJohnstone, SCao, ZGao, XJaen, JCLiu, JLively, SMiao, SSudom, ATomooka, CWalker, NPWright, MYan, XYe, QPowers, JP Discovery of potent, selective, and orally bioavailable inhibitors of interleukin-1 receptor-associate kinase-4. Bioorg Med Chem Lett 25:5546-50 (2015)  
Target
Name:
Interleukin-1 receptor-associated kinase 4
Synonyms:
IRAK-4 IRAK4_HUMAN Interleukin-1 receptor-associated kinase 4 (IRAK4) | Renal carcinoma antigen NY-REN-64
Type:
Protein
Mol. Mass.:
51519.08
Organism:
Homo sapiens (Human)
Description:
Q9NWZ3
Residue:
460
  
Inhibitor
Name:
BDBM50499197
Synonyms:
CHEMBL3736465
Type:
Small organic molecule
Emp. Form.:
C29H29F3N4O2
Mol. Mass.:
522.5614
SMILES:
OCCc1ccc(cc1)-n1c(NC(=O)c2cccc(c2)C(F)(F)F)nc2cc(CN3CCCCC3)ccc12
: