Target
Glucocorticoid receptor
Ligand
BDBM50499248
Substrate
Meas. Tech.
ChEMBL_1540293 (CHEMBL3739124)
Ki
0.210000±n/a nM
Citation
 Hunt, HJBelanoff, JKGolding, EGourdet, BPhillips, TSwift, DThomas, JUnitt, JFWalters, I 1H-Pyrazolo[3,4-g]hexahydro-isoquinolines as potent GR antagonists with reduced hERG inhibition and an improved pharmacokinetic profile. Bioorg Med Chem Lett 25:5720-5 (2015)  
Target
Name:
Glucocorticoid receptor
Synonyms:
GCR_HUMAN GRL Glucocorticoid receptor (GRFP) Nuclear receptor subfamily 3 group C member 1
Type:
Enzyme
Mol. Mass.:
85656.87
Organism:
Homo sapiens (Human)
Description:
P04150
Residue:
777
  
Inhibitor
Name:
BDBM50499248
Synonyms:
CHEMBL3735549
Type:
Small organic molecule
Emp. Form.:
C29H25FN4O3S
Mol. Mass.:
528.597
SMILES:
Cc1ccccc1S(=O)(=O)N1CCC2=Cc3c(C[C@@]2(C1)C(=O)c1ccccn1)cnn3-c1ccc(F)cc1
: