Target
Angiotensin-converting enzyme
Ligand
BDBM50048512
Substrate
Meas. Tech.
ChEMBL_34783 (CHEMBL646224)
IC50
12±n/a nM
Citation
 Robl, JACimarusti, MPSimpkins, LMBrown, BRyono, DEBird, JEAsaad, MMSchaeffer, TRTrippodo, NC Dual metalloprotease inhibitors. 6. Incorporation of bicyclic and substituted monocyclic azepinones as dipeptide surrogates in angiotensin-converting enzyme/neutral endopeptidase inhibitors. J Med Chem 39:494-502 (1996)  
Target
Name:
Angiotensin-converting enzyme
Synonyms:
3.2.1.- ACE Angiotensin-converting enzyme, soluble form DCP1 Kininase II
Type:
Mol. Mass.:
150405.15
Organism:
Oryctolagus cuniculus
Description:
Residue:
1310
  
Inhibitor
Name:
BDBM50048512
Synonyms:
CHEMBL299639 [3-((S)-2-Mercapto-3-(S)-phenyl-propionylamino)-2-oxo-2,3,4,5-tetrahydro-benzo[b]azepin-1-yl]-acetic acid
Type:
Small organic molecule
Emp. Form.:
C21H22N2O4S
Mol. Mass.:
398.475
SMILES:
OC(=O)CN1c2ccccc2CC[C@H](NC(=O)[C@@H](S)Cc2ccccc2)C1=O
: