Target
Angiotensin-converting enzyme
Ligand
BDBM50048505
Substrate
Meas. Tech.
ChEMBL_34783 (CHEMBL646224)
IC50
5±n/a nM
Citation
 Robl, JACimarusti, MPSimpkins, LMBrown, BRyono, DEBird, JEAsaad, MMSchaeffer, TRTrippodo, NC Dual metalloprotease inhibitors. 6. Incorporation of bicyclic and substituted monocyclic azepinones as dipeptide surrogates in angiotensin-converting enzyme/neutral endopeptidase inhibitors. J Med Chem 39:494-502 (1996)  
Target
Name:
Angiotensin-converting enzyme
Synonyms:
3.2.1.- ACE Angiotensin-converting enzyme, soluble form DCP1 Kininase II
Type:
Mol. Mass.:
150405.15
Organism:
Oryctolagus cuniculus
Description:
Residue:
1310
  
Inhibitor
Name:
BDBM50048505
Synonyms:
(S)-2-[(3S,7S)-3-((S)-2-Mercapto-3-phenyl-propionylamino)-2-oxo-7-propyl-azepan-1-yl]-propionic acid | CHEMBL434070
Type:
Small organic molecule
Emp. Form.:
C21H30N2O4S
Mol. Mass.:
406.539
SMILES:
CCC[C@H]1CCC[C@H](NC(=O)[C@@H](S)Cc2ccccc2)C(=O)N1[C@@H](C)C(O)=O
: