Target
Sphingosine 1-phosphate receptor 3
Ligand
BDBM50499644
Substrate
Meas. Tech.
ChEMBL_1542581 (CHEMBL3744620)
IC50
3.0±n/a nM
Citation
 Hobson, ADHarris, CMvan der Kam, ELTurner, SCAbibi, AAguirre, ALBousquet, PKebede, TKonopacki, DBGintant, GKim, YLarson, KMaull, JWMoore, NSShi, DShrestha, ATang, XZhang, PSarris, KK Discovery of A-971432, An Orally Bioavailable Selective Sphingosine-1-Phosphate Receptor 5 (S1P5) Agonist for the Potential Treatment of Neurodegenerative Disorders. J Med Chem 58:9154-70 (2015)  
Target
Name:
Sphingosine 1-phosphate receptor 3
Synonyms:
C9orf108 EDG3 S1P receptor 3 S1P3 S1PR3_HUMAN Sphingosine 1-phosphate receptor 3 (S1P3) | Sphingosine 1-phosphate receptor Edg-3
Type:
G Protein-Coupled Receptor (GPCR)
Mol. Mass.:
42278.13
Organism:
Homo sapiens (Human)
Description:
Q99500
Residue:
378
  
Inhibitor
Name:
BDBM50499644
Synonyms:
CHEMBL3741414
Type:
Small organic molecule
Emp. Form.:
C20H34NO5P
Mol. Mass.:
399.4614
SMILES:
CCCCCCCCOc1ccc(cc1)[C@@H]1CC[C@](N)(COP(O)(O)=O)C1
: