Target
D(2) dopamine receptor
Ligand
BDBM50048809
Substrate
Meas. Tech.
ChEMBL_61415 (CHEMBL675883)
IC50
180±n/a nM
Citation
 Norman, MHMinick, DJRigdon, GC Effect of linking bridge modifications on the antipsychotic profile of some phthalimide and isoindolinone derivatives. J Med Chem 39:149-57 (1996)  
Target
Name:
D(2) dopamine receptor
Synonyms:
DOPAMINE D2 DOPAMINE D2 Short Dopamine D2 receptor Drd2
Type:
G Protein-Coupled Receptor (GPCR)
Mol. Mass.:
50931.60
Organism:
Rattus norvegicus (rat)
Description:
P61169
Residue:
444
  
Inhibitor
Name:
BDBM50048809
Synonyms:
2-{2-[2-(4-Benzo[d]isothiazol-3-yl-piperazin-1-yl)-ethoxy]-ethyl}-2,3-dihydro-isoindol-1-one | CHEMBL288450
Type:
Small organic molecule
Emp. Form.:
C23H26N4O2S
Mol. Mass.:
422.543
SMILES:
O=C1N(CCOCCN2CCN(CC2)c2nsc3ccccc23)Cc2ccccc12
: