Target
D(2) dopamine receptor
Ligand
BDBM50048811
Substrate
Meas. Tech.
ChEMBL_61415 (CHEMBL675883)
IC50
130±n/a nM
Citation
 Norman, MHMinick, DJRigdon, GC Effect of linking bridge modifications on the antipsychotic profile of some phthalimide and isoindolinone derivatives. J Med Chem 39:149-57 (1996)  
Target
Name:
D(2) dopamine receptor
Synonyms:
DOPAMINE D2 DOPAMINE D2 Short Dopamine D2 receptor Drd2
Type:
G Protein-Coupled Receptor (GPCR)
Mol. Mass.:
50931.60
Organism:
Rattus norvegicus (rat)
Description:
P61169
Residue:
444
  
Inhibitor
Name:
BDBM50048811
Synonyms:
2-[(Z)-4-(4-Benzo[d]isothiazol-3-yl-piperazin-1-yl)-but-2-enyl]-isoindole-1,3-dione | CHEMBL43069
Type:
Small organic molecule
Emp. Form.:
C23H22N4O2S
Mol. Mass.:
418.511
SMILES:
O=C1N(C\C=C/CN2CCN(CC2)c2nsc3ccccc23)C(=O)c2ccccc12
: