Target
5-hydroxytryptamine receptor 1A
Ligand
BDBM50048822
Substrate
Meas. Tech.
ChEMBL_845 (CHEMBL615901)
IC50
390±n/a nM
Citation
 Norman, MHMinick, DJRigdon, GC Effect of linking bridge modifications on the antipsychotic profile of some phthalimide and isoindolinone derivatives. J Med Chem 39:149-57 (1996)  
Target
Name:
5-hydroxytryptamine receptor 1A
Synonyms:
5-HT-1A 5-HT1A 5-hydroxytryptamine receptor 1A (5HT1A) 5ht1a Htr1a Serotonin 1a (5-HT1a) receptor/Adrenergic receptor alpha-1 | Serotonin receptor 1A
Type:
G Protein-Coupled Receptor (GPCR)
Mol. Mass.:
46445.29
Organism:
Rattus norvegicus (rat)
Description:
Binding assays were performed using rat hippocampal membranes.
Residue:
422
  
Inhibitor
Name:
BDBM50048822
Synonyms:
2-[3-(4-Benzo[d]isothiazol-3-yl-piperazin-1-yl)-propyl]-2,3-dihydro-isoindol-1-one | CHEMBL441430
Type:
Small organic molecule
Emp. Form.:
C22H24N4OS
Mol. Mass.:
392.517
SMILES:
O=C1N(CCCN2CCN(CC2)c2nsc3ccccc23)Cc2ccccc12
: