Target
5-hydroxytryptamine receptor 1A
Ligand
BDBM50048819
Substrate
Meas. Tech.
ChEMBL_845 (CHEMBL615901)
IC50
54±n/a nM
Citation
 Norman, MHMinick, DJRigdon, GC Effect of linking bridge modifications on the antipsychotic profile of some phthalimide and isoindolinone derivatives. J Med Chem 39:149-57 (1996)  
Target
Name:
5-hydroxytryptamine receptor 1A
Synonyms:
5-HT-1A 5-HT1A 5-hydroxytryptamine receptor 1A (5HT1A) 5ht1a Htr1a Serotonin 1a (5-HT1a) receptor/Adrenergic receptor alpha-1 | Serotonin receptor 1A
Type:
G Protein-Coupled Receptor (GPCR)
Mol. Mass.:
46445.29
Organism:
Rattus norvegicus (rat)
Description:
Binding assays were performed using rat hippocampal membranes.
Residue:
422
  
Inhibitor
Name:
BDBM50048819
Synonyms:
2-{2-[2-(4-Benzo[d]isothiazol-3-yl-piperazin-1-yl)-ethoxy]-ethyl}-isoindole-1,3-dione | CHEMBL38747
Type:
Small organic molecule
Emp. Form.:
C23H24N4O3S
Mol. Mass.:
436.527
SMILES:
O=C1N(CCOCCN2CCN(CC2)c2nsc3ccccc23)C(=O)c2ccccc12
: