Target
Tumor necrosis factor
Ligand
BDBM50048920
Substrate
Meas. Tech.
ChEMBL_212395 (CHEMBL873375)
IC50
19000±n/a nM
Citation
 Cottam, HBShih, HTehrani, LRWasson, DBCarson, DA Substituted xanthines, pteridinediones, and related compounds as potential antiinflammatory agents. Synthesis and biological evaluation of inhibitors of tumor necrosis factor alpha. J Med Chem 39:2-9 (1996)  
Target
Name:
Tumor necrosis factor
Synonyms:
Cachectin TNF-a TNFA TNFSF2 Tumor necrosis factor (TNFa) Tumor necrosis factor ligand superfamily member 2 Tumor necrosis factor, soluble form | tumor necrosis factor alpha
Type:
Enzyme
Mol. Mass.:
25645.11
Organism:
Homo sapiens (Human)
Description:
P01375
Residue:
233
  
Inhibitor
Name:
BDBM50048920
Synonyms:
4-[2,4-Dioxo-1-(tetrahydro-furan-3-yl)-1,4-dihydro-2H-pteridin-3-yl]-butyric acid ethyl ester | CHEMBL355042
Type:
Small organic molecule
Emp. Form.:
C16H20N4O5
Mol. Mass.:
348.3538
SMILES:
CCOC(=O)CCCn1c(=O)n(C2CCOC2)c2nccnc2c1=O
: