Target
Polyunsaturated fatty acid 5-lipoxygenase
Ligand
BDBM50006817
Substrate
Meas. Tech.
ChEMBL_3905 (CHEMBL619910)
IC50
480±n/a nM
Citation
 Hamer, RRTegeler, JJKurtz, ESAllen, RCBailey, SCElliott, MEHellyer, LHelsley, GCPrzekop, PFreed, BSWhite, JMartin, LL Dibenzoxepinone hydroxylamines and hydroxamic acids: dual inhibitors of cyclooxygenase and 5-lipoxygenase with potent topical antiinflammatory activity. J Med Chem 39:246-52 (1996)  
Target
Name:
Polyunsaturated fatty acid 5-lipoxygenase
Synonyms:
Alox5 LOX5_RAT
Type:
PROTEIN
Mol. Mass.:
78082.31
Organism:
Rattus norvegicus
Description:
ChEMBL_1432947
Residue:
673
  
Inhibitor
Name:
BDBM50006817
Synonyms:
9-Phenyl-nonanoic acid hydroxyamide CHEMBL85776
Type:
Small organic molecule
Emp. Form.:
C15H23NO2
Mol. Mass.:
249.3486
SMILES:
ONC(=O)CCCCCCCCc1ccccc1
: