Target
Polyunsaturated fatty acid 5-lipoxygenase
Ligand
BDBM50048995
Substrate
Meas. Tech.
ChEMBL_3905 (CHEMBL619910)
IC50
1300±n/a nM
Citation
 Hamer, RRTegeler, JJKurtz, ESAllen, RCBailey, SCElliott, MEHellyer, LHelsley, GCPrzekop, PFreed, BSWhite, JMartin, LL Dibenzoxepinone hydroxylamines and hydroxamic acids: dual inhibitors of cyclooxygenase and 5-lipoxygenase with potent topical antiinflammatory activity. J Med Chem 39:246-52 (1996)  
Target
Name:
Polyunsaturated fatty acid 5-lipoxygenase
Synonyms:
Alox5 LOX5_RAT
Type:
PROTEIN
Mol. Mass.:
78082.31
Organism:
Rattus norvegicus
Description:
ChEMBL_1432947
Residue:
673
  
Inhibitor
Name:
BDBM50048995
Synonyms:
CHEMBL82325 | N-Hydroxy-N-methyl-2-(11-oxo-6,11-dihydro-dibenzo[b,e]oxepin-2-yl)-propionamide
Type:
Small organic molecule
Emp. Form.:
C18H17NO4
Mol. Mass.:
311.3319
SMILES:
CC(C(=O)N(C)O)c1ccc2OCc3ccccc3C(=O)c2c1
: