Target
D(1A) dopamine receptor
Ligand
BDBM50049046
Substrate
Meas. Tech.
ChEMBL_58157 (CHEMBL672680)
EC50
>10000±n/a nM
Citation
 Mottola, DMLaiter, SWatts, VJTropsha, AWyrick, SDNichols, DEMailman, RB Conformational analysis of D1 dopamine receptor agonists: pharmacophore assessment and receptor mapping. J Med Chem 39:285-96 (1996)  
Target
Name:
D(1A) dopamine receptor
Synonyms:
DOPAMINE D1 Dopamine D1 high Dopamine receptor Dopamine1-like Drd1a
Type:
Enzyme Catalytic Domain
Mol. Mass.:
49429.75
Organism:
RAT
Description:
P18901
Residue:
446
  
Inhibitor
Name:
BDBM50049046
Synonyms:
(6aR,12bS)-6-Allyl-5,6,6a,7,8,12b-hexahydro-benzo[a]phenanthridine-10,11-diol | CHEMBL317647
Type:
Small organic molecule
Emp. Form.:
C20H21NO2
Mol. Mass.:
307.3862
SMILES:
Oc1cc2CC[C@@H]3[C@H](c4ccccc4CN3CC=C)c2cc1O
: