Target
D(1A) dopamine receptor
Ligand
BDBM50049048
Substrate
Meas. Tech.
ChEMBL_58157 (CHEMBL672680)
EC50
491±n/a nM
Citation
 Mottola, DMLaiter, SWatts, VJTropsha, AWyrick, SDNichols, DEMailman, RB Conformational analysis of D1 dopamine receptor agonists: pharmacophore assessment and receptor mapping. J Med Chem 39:285-96 (1996)  
Target
Name:
D(1A) dopamine receptor
Synonyms:
DOPAMINE D1 Dopamine D1 high Dopamine receptor Dopamine1-like Drd1a
Type:
Enzyme Catalytic Domain
Mol. Mass.:
49429.75
Organism:
RAT
Description:
P18901
Residue:
446
  
Inhibitor
Name:
BDBM50049048
Synonyms:
(R)-3-Allyl-6-chloro-1-phenyl-2,3,4,5-tetrahydro-1H-benzo[d]azepine-7,8-diol 3-Allyl-6-chloro-7,8-dihydroxy-1-phenyl-2,3,4,5-tetrahydro-1H-benzo[d]azepinium(Cl-APB) SK&F-82958 | SK-82958
Type:
Small organic molecule
Emp. Form.:
C19H20ClNO2
Mol. Mass.:
329.821
SMILES:
Oc1cc2[C@H](CN(CC=C)CCc2c(Cl)c1O)c1ccccc1
: