Target
5-hydroxytryptamine receptor 1B
Ligand
BDBM50049096
Substrate
Meas. Tech.
ChEMBL_2025 (CHEMBL617320)
Ki
21±n/a nM
Citation
 Glennon, RAHong, SSBondarev, MLaw, HDukat, MRakhi, SPower, PFan, EKinneau, DKamboj, RTeitler, MHerrick-Davis, KSmith, C Binding of O-alkyl derivatives of serotonin at human 5-HT1D beta receptors. J Med Chem 39:314-22 (1996)  
Target
Name:
5-hydroxytryptamine receptor 1B
Synonyms:
5-HT-1B 5-HT1B 5HT1B_HUMAN HTR1DB Serotonin (5-HT) receptor Serotonin Receptor 1B
Type:
G Protein-Coupled Receptor (GPCR)
Mol. Mass.:
43579.17
Organism:
Homo sapiens (Human)
Description:
Receptor binding assays were performed using human clone stably expressed in CHO cells
Residue:
390
  
Inhibitor
Name:
BDBM50049096
Synonyms:
2-(5-Undecyloxy-1H-indol-3-yl)-ethylamine | CHEMBL109839
Type:
Small organic molecule
Emp. Form.:
C21H34N2O
Mol. Mass.:
330.5075
SMILES:
CCCCCCCCCCCOc1ccc2[nH]cc(CCN)c2c1
: