Target
Thymidylate synthase
Ligand
BDBM50049162
Substrate
Meas. Tech.
ChEMBL_209957 (CHEMBL820613)
IC50
10.0±n/a nM
Citation
 Bavetsias, VJackman, ALKimbell, RGibson, WBoyle, FTBisset, GM Quinazoline antifolate thymidylate synthase inhibitors: gamma-linked L-D, D-D, and D-L dipeptide analogues of 2-desamino-2-methyl-N10-propargyl-5,8-dideazafolic acid (ICI 198583). J Med Chem 39:73-85 (1996)  
Target
Name:
Thymidylate synthase
Synonyms:
TS TYSY_MOUSE | Tyms
Type:
PROTEIN
Mol. Mass.:
34957.15
Organism:
Mus musculus
Description:
ChEMBL_1340097
Residue:
307
  
Inhibitor
Name:
BDBM50049162
Synonyms:
(R)-2-((S)-4-Carboxy-4-{4-[(2-methyl-4-oxo-3,4-dihydro-quinazolin-6-ylmethyl)-prop-2-ynyl-amino]-benzoylamino}-butyrylamino)-hexanedioic acid; TFA | CHEMBL168970
Type:
Small organic molecule
Emp. Form.:
C31H33N5O9
Mol. Mass.:
619.6218
SMILES:
Cc1nc2ccc(CN(CC#C)c3ccc(cc3)C(=O)N[C@@H](CCC(=O)N[C@H](CCCC(O)=O)C(O)=O)C(O)=O)cc2c(=O)[nH]1
: