Target
Thymidylate synthase
Ligand
BDBM50049171
Substrate
Meas. Tech.
ChEMBL_209957 (CHEMBL820613)
IC50
30±n/a nM
Citation
 Bavetsias, VJackman, ALKimbell, RGibson, WBoyle, FTBisset, GM Quinazoline antifolate thymidylate synthase inhibitors: gamma-linked L-D, D-D, and D-L dipeptide analogues of 2-desamino-2-methyl-N10-propargyl-5,8-dideazafolic acid (ICI 198583). J Med Chem 39:73-85 (1996)  
Target
Name:
Thymidylate synthase
Synonyms:
TS TYSY_MOUSE | Tyms
Type:
PROTEIN
Mol. Mass.:
34957.15
Organism:
Mus musculus
Description:
ChEMBL_1340097
Residue:
307
  
Inhibitor
Name:
BDBM50049171
Synonyms:
2-(4-Carboxy-4-{4-[(2-methyl-4-oxo-3,4-dihydro-quinazolin-6-ylmethyl)-prop-2-ynyl-amino]-benzoylamino}-butyrylamino)-pentanedioic acidTFA. 0.7 Et2O | CHEMBL352357
Type:
Small organic molecule
Emp. Form.:
C34H33N5O7
Mol. Mass.:
623.6551
SMILES:
Cc1nc2ccc(CN(CC#C)c3ccc(cc3)C(=O)N[C@@H](CCC(=O)NC(Cc3ccccc3)C(O)=O)C(O)=O)cc2c(=O)[nH]1
: