Target
Thymidylate synthase
Ligand
BDBM50049168
Substrate
Meas. Tech.
ChEMBL_209973 (CHEMBL820628)
Ki
0.12±n/a nM
Citation
 Bavetsias, VJackman, ALKimbell, RGibson, WBoyle, FTBisset, GM Quinazoline antifolate thymidylate synthase inhibitors: gamma-linked L-D, D-D, and D-L dipeptide analogues of 2-desamino-2-methyl-N10-propargyl-5,8-dideazafolic acid (ICI 198583). J Med Chem 39:73-85 (1996)  
Target
Name:
Thymidylate synthase
Synonyms:
TS TYSY_MOUSE | Tyms
Type:
PROTEIN
Mol. Mass.:
34957.15
Organism:
Mus musculus
Description:
ChEMBL_1340097
Residue:
307
  
Inhibitor
Name:
BDBM50049168
Synonyms:
(R)-2-((S)-4-Carboxy-4-{4-[(2,7-dimethyl-4-oxo-3,4-dihydro-quinazolin-6-ylmethyl)-prop-2-ynyl-amino]-2-fluoro-benzoylamino}-butyrylamino)-hexanedioic acid; TFA | CHEMBL349432
Type:
Small organic molecule
Emp. Form.:
C32H34FN5O9
Mol. Mass.:
651.6389
SMILES:
Cc1nc2cc(C)c(CN(CC#C)c3ccc(C(=O)N[C@@H](CCC(=O)N[C@H](CCCC(O)=O)C(O)=O)C(O)=O)c(F)c3)cc2c(=O)[nH]1
: