Target
Thymidylate synthase
Ligand
BDBM50049161
Substrate
Meas. Tech.
ChEMBL_209957 (CHEMBL820613)
IC50
12±n/a nM
Citation
 Bavetsias, VJackman, ALKimbell, RGibson, WBoyle, FTBisset, GM Quinazoline antifolate thymidylate synthase inhibitors: gamma-linked L-D, D-D, and D-L dipeptide analogues of 2-desamino-2-methyl-N10-propargyl-5,8-dideazafolic acid (ICI 198583). J Med Chem 39:73-85 (1996)  
Target
Name:
Thymidylate synthase
Synonyms:
TS TYSY_MOUSE | Tyms
Type:
PROTEIN
Mol. Mass.:
34957.15
Organism:
Mus musculus
Description:
ChEMBL_1340097
Residue:
307
  
Inhibitor
Name:
BDBM50049161
Synonyms:
(S)-4-((R)-1-Carboxy-ethylcarbamoyl)-2-{4-[(2-methyl-4-oxo-3,4-dihydro-quinazolin-6-ylmethyl)-prop-2-ynyl-amino]-benzoylamino}-butyric acid; TFA | CHEMBL170975
Type:
Small organic molecule
Emp. Form.:
C28H29N5O7
Mol. Mass.:
547.5592
SMILES:
C[C@@H](NC(=O)CC[C@H](NC(=O)c1ccc(cc1)N(CC#C)Cc1ccc2nc(C)[nH]c(=O)c2c1)C(O)=O)C(O)=O
: