Target
Substance-P receptor
Ligand
BDBM50049470
Substrate
Meas. Tech.
ChEMBL_205722 (CHEMBL807968)
IC50
19±n/a nM
Citation
 Hale, JJMills, SGMacCoss, MShah, SKQi, HMathre, DJCascieri, MASadowski, SStrader, CDMacIntyre, DEMetzger, JM 2(S)-((3,5-bis(trifluoromethyl)benzyl)-oxy)-3(S)-phenyl-4- ((3-oxo-1,2,4-triazol-5-yl)methyl)morpholine (1): a potent, orally active, morpholine-based human neurokinin-1 receptor antagonist. J Med Chem 39:1760-2 (1996)  
Target
Name:
Substance-P receptor
Synonyms:
NK-1 receptor NK1 Receptor NK1R_HUMAN Neurokinin-1 (NK-1) SPR TACR1 Tachykinin receptor 1 (NK1) | tachykinin
Type:
G Protein-Coupled Receptor (GPCR)
Mol. Mass.:
46254.43
Organism:
Homo sapiens (Human)
Description:
P25103
Residue:
407
  
Inhibitor
Name:
BDBM50049470
Synonyms:
(2R,3S)-2-(3,5-Bis-trifluoromethyl-benzyloxy)-3-phenyl-morpholine | CHEMBL300722
Type:
Small organic molecule
Emp. Form.:
C19H17F6NO2
Mol. Mass.:
405.3342
SMILES:
FC(F)(F)c1cc(CO[C@@H]2OCCN[C@H]2c2ccccc2)cc(c1)C(F)(F)F
: